Discussion

5
Replies
472
Views
VigneshAravind Member since 2007 28 posts
Cognizant
Posted: 3 years ago
Last activity: 3 years 5 months ago
Closed

Failed to find a 'RULE-OBJ-ACTIVITY' with the name 'PXPOSTUPGRADEQUICK' that applies to 'PegaAccel-Management-PostUpgrade'

This is our environment Unix + Oracle 12C + PRPC 7.2.1 in which we are upgrading an application from PRPC 6.1 SP2
We are at the second step in a split-schema out-of-place upgrade -aka- "rules upgrade"
While running the upgrade.sh we are receiving the below error; kindly verify and help us.

[java] 2017-04-08 11:39:01,399 [ Linux Box] [ STANDARD] [ ] ( internal.util.UpdateWizard) INFO - UpgradeApplicationsSchema: false
[java] Apr 08, 2017 11:39:01 AM com.pega.pegarules.internal.bootstrap.PRBootstrap
[java] SEVERE: Problem during method invocation (main)
[java] com.pega.pegarules.pub.generator.RuleNotFoundException: Failed to find a 'RULE-OBJ-ACTIVITY' with the name 'PXPOSTUPGRADEQUICK' that applies to 'PegaAccel-Management-PostUpgrade'; no rules with this name were found in the rulebase.
[java] at com.pega.pegarules.generation.internal.vtable.ruleres.VirtualTableResolver.checkCandidateList(VirtualTableResolver.java:691)
[java] at com.pega.pegarules.generation.internal.vtable.ruleres.VirtualTableResolver.resolveRule(VirtualTableResolver.java:150)
[java] at com.pega.pegarules.generation.internal.vtable.VirtualTableImpl.resolveRule(VirtualTableImpl.java:311)
[java] at com.pega.pegarules.generation.internal.PRGenProviderImpl.get(PRGenProviderImpl.java:498)
[java] at com.pega.pegarules.session.internal.mgmt.Executable.doActivity(Executable.java:3510)
[java] at com.pega.pegarules.deploy.internal.util.UpdateWizard.runUpdate(UpdateWizard.java:114)
[java] at com.pega.pegarules.deploy.internal.util.UpdateWizard.callProcess(UpdateWizard.java:196)
[java] at com.pega.pegarules.deploy.internal.util.UpdateWizard.main(UpdateWizard.java:166)
[java] at sun.reflect.NativeMethodAccessorImpl.invoke0(Native Method)
[java] at sun.reflect.NativeMethodAccessorImpl.invoke(NativeMethodAccessorImpl.java:95)
[java] at sun.reflect.DelegatingMethodAccessorImpl.invoke(DelegatingMethodAccessorImpl.java:55)
[java] at java.lang.reflect.Method.invoke(Method.java:507)
[java] at com.pega.pegarules.internal.bootstrap.PRBootstrap.invokeMethod(PRBootstrap.java:370)
[java] at com.pega.pegarules.internal.bootstrap.PRBootstrap.invokeMethodPropagatingThrowable(PRBootstrap.java:411)
[java] at com.pega.pegarules.boot.internal.extbridge.AppServerBridgeToPega.invokeMethodPropagatingThrowable(AppServerBridgeToPega.java:224)
[java] at com.pega.pegarules.boot.internal.extbridge.AppServerBridgeToPega.invokeMethod(AppServerBridgeToPega.java:273)
[java] at com.pega.pegarules.pub.PegaRULES.main(PegaRULES.java:85)
[java]
[java] Apr 08, 2017 11:39:01 AM com.pega.pegarules.boot.internal.extbridge.AppServerBridgeToPega
[java] SEVERE: Problem during method invocation (main)
[java] com.pega.pegarules.pub.generator.RuleNotFoundException: Failed to find a 'RULE-OBJ-ACTIVITY' with the name 'PXPOSTUPGRADEQUICK' that applies to 'PegaAccel-Management-PostUpgrade'; no rules with this name were found in the rulebase.
[java] at com.pega.pegarules.generation.internal.vtable.ruleres.VirtualTableResolver.checkCandidateList(VirtualTableResolver.java:691)
[java] at com.pega.pegarules.generation.internal.vtable.ruleres.VirtualTableResolver.resolveRule(VirtualTableResolver.java:150)
[java] at com.pega.pegarules.generation.internal.vtable.VirtualTableImpl.resolveRule(VirtualTableImpl.java:311)
[java] at com.pega.pegarules.generation.internal.PRGenProviderImpl.get(PRGenProviderImpl.java:498)
[java] at com.pega.pegarules.session.internal.mgmt.Executable.doActivity(Executable.java:3510)
[java] at com.pega.pegarules.deploy.internal.util.UpdateWizard.runUpdate(UpdateWizard.java:114)
[java] at com.pega.pegarules.deploy.internal.util.UpdateWizard.callProcess(UpdateWizard.java:196)
[java] at com.pega.pegarules.deploy.internal.util.UpdateWizard.main(UpdateWizard.java:166)
[java] at sun.reflect.NativeMethodAccessorImpl.invoke0(Native Method)
[java] at sun.reflect.NativeMethodAccessorImpl.invoke(NativeMethodAccessorImpl.java:95)
[java] at sun.reflect.DelegatingMethodAccessorImpl.invoke(DelegatingMethodAccessorImpl.java:55)
[java] at java.lang.reflect.Method.invoke(Method.java:507)
[java] at com.pega.pegarules.internal.bootstrap.PRBootstrap.invokeMethod(PRBootstrap.java:370)
[java] at com.pega.pegarules.internal.bootstrap.PRBootstrap.invokeMethodPropagatingThrowable(PRBootstrap.java:411)
[java] at com.pega.pegarules.boot.internal.extbridge.AppServerBridgeToPega.invokeMethodPropagatingThrowable(AppServerBridgeToPega.java:224)
[java] at com.pega.pegarules.boot.internal.extbridge.AppServerBridgeToPega.invokeMethod(AppServerBridgeToPega.java:273)
[java] at com.pega.pegarules.pub.PegaRULES.main(PegaRULES.java:85)
[java]
[java] Exception in thread "Linux Box" java.lang.RuntimeException: Problem during method invocation (main)
[java] at com.pega.pegarules.boot.internal.extbridge.AppServerBridgeToPega.invokeMethod(AppServerBridgeToPega.java:279)
[java] at com.pega.pegarules.pub.PegaRULES.main(PegaRULES.java:85)
[java] Caused by: com.pega.pegarules.pub.generator.RuleNotFoundException: Failed to find a 'RULE-OBJ-ACTIVITY' with the name 'PXPOSTUPGRADEQUICK' that applies to 'PegaAccel-Management-PostUpgrade'; no rules with this name were found in the rulebase.
[java] at com.pega.pegarules.generation.internal.vtable.ruleres.VirtualTableResolver.checkCandidateList(VirtualTableResolver.java:691)
[java] at com.pega.pegarules.generation.internal.vtable.ruleres.VirtualTableResolver.resolveRule(VirtualTableResolver.java:150)
[java] at com.pega.pegarules.generation.internal.vtable.VirtualTableImpl.resolveRule(VirtualTableImpl.java:311)
[java] at com.pega.pegarules.generation.internal.PRGenProviderImpl.get(PRGenProviderImpl.java:498)
[java] at com.pega.pegarules.session.internal.mgmt.Executable.doActivity(Executable.java:3510)
[java] at com.pega.pegarules.deploy.internal.util.UpdateWizard.runUpdate(UpdateWizard.java:114)
[java] at com.pega.pegarules.deploy.internal.util.UpdateWizard.callProcess(UpdateWizard.java:196)
[java] at com.pega.pegarules.deploy.internal.util.UpdateWizard.main(UpdateWizard.java:166)
[java] at sun.reflect.NativeMethodAccessorImpl.invoke0(Native Method)
[java] at sun.reflect.NativeMethodAccessorImpl.invoke(NativeMethodAccessorImpl.java:95)
[java] at sun.reflect.DelegatingMethodAccessorImpl.invoke(DelegatingMethodAccessorImpl.java:55)
[java] at java.lang.reflect.Method.invoke(Method.java:507)
[java] at com.pega.pegarules.internal.bootstrap.PRBootstrap.invokeMethod(PRBootstrap.java:370)
[java] at com.pega.pegarules.internal.bootstrap.PRBootstrap.invokeMethodPropagatingThrowable(PRBootstrap.java:411)
[java] at com.pega.pegarules.boot.internal.extbridge.AppServerBridgeToPega.invokeMethodPropagatingThrowable(AppServerBridgeToPega.java:224)
[java] at com.pega.pegarules.boot.internal.extbridge.AppServerBridgeToPega.invokeMethod(AppServerBridgeToPega.java:273)
[java] ... 1 more

BUILD FAILED
/home/XYZ/scripts/setupDatabase.xml:362: The following error occurred while executing this line:
/home/XYZ/scripts/setupDatabase.xml:2591: Java returned: 1

Low-Code App Development Upgrades
Moderation Team has archived post
Share this page LinkedIn