Question

7
Replies
1520
Views
AnkuK339 Member since 2016 2 posts
Capgemini
Posted: 4 years ago
Last activity: 4 years 7 months ago
Closed

Hi I am facing below error while Installing Pega7 in my machine..

BUILD FAILED

I:\Pega\PegaPearsonEdition_V7.1\114898_PE719\pegaGuiInstallerTemp11\build.xml:191: The following error occurred while executing this line:

I:\Pega\PegaPearsonEdition_V7.1\114898_PE719\pegaGuiInstallerTemp11\build.xml:75: exec returned: 1

Total time: 1 minute 19 seconds

org.tp23.antinstaller.InstallException: Use logs to find the cause, then correct and run again

at org.tp23.antinstaller.runtime.exe.AntLauncherFilter.exec(AntLauncherFilter.java:89)

at org.tp23.antinstaller.runtime.ExecInstall.exec(ExecInstall.java:87)

at org.tp23.antinstaller.selfextract.SelfExtractor.main(SelfExtractor.java:398)

Caused by: org.tp23.antinstaller.InstallException: Use logs to find the cause, then correct and run again

at org.tp23.antinstaller.runtime.exe.AntLauncherFilter.exec(AntLauncherFilter.java:79)

... 2 more

--- Nested Exception ---

org.tp23.antinstaller.InstallException: Use logs to find the cause, then correct and run again

at org.tp23.antinstaller.runtime.exe.AntLauncherFilter.exec(AntLauncherFilter.java:79)

at org.tp23.antinstaller.runtime.ExecInstall.exec(ExecInstall.java:87)

at org.tp23.antinstaller.selfextract.SelfExtractor.main(SelfExtractor.java:398)

Please help.

Low-Code App Development Installation and Deployment System Administration
Moderation Team has archived post
Share this page LinkedIn