Question

16
Replies
267
Views
vivekt03 Member since 2015 1 post
Capgemini India Pvt. Ltd.
Posted: February 28, 2016
Last activity: April 7, 2017
Closed

I am new to the pega and have learning/practising through the online. When I decided to install it locally(Pega 7) it's causing the problem.

I am new to the pega and have learning/practising through the online. When I decided to install it locally(Pega 7) it's causing the problem.

After finishing all the steps, it starts installing the pega 7 in my system but spending 2 minutes of time during installation suddenly throws below error:

BUILD FAILED

E:\114898_PE719\pegaGuiInstallerTemp16\build.xml:192: The following error occurred while executing this line:

E:\114898_PE719\pegaGuiInstallerTemp16\build.xml:75: exec returned: 1

Total time: 1 minute 35 seconds

org.tp23.antinstaller.InstallException: Use logs to find the cause, then correct and run again

at org.tp23.antinstaller.runtime.exe.AntLauncherFilter.exec(AntLauncherFilter.java:89)

at org.tp23.antinstaller.runtime.ExecInstall.exec(ExecInstall.java:87)

at org.tp23.antinstaller.selfextract.SelfExtractor.main(SelfExtractor.java:398)

Caused by: org.tp23.antinstaller.InstallException: Use logs to find the cause, then correct and run again

at org.tp23.antinstaller.runtime.exe.AntLauncherFilter.exec(AntLauncherFilter.java:79)

... 2 more

--- Nested Exception ---

org.tp23.antinstaller.InstallException: Use logs to find the cause, then correct and run again

at org.tp23.antinstaller.runtime.exe.AntLauncherFilter.exec(AntLauncherFilter.java:79)

at org.tp23.antinstaller.runtime.ExecInstall.exec(ExecInstall.java:87)

at org.tp23.antinstaller.selfextract.SelfExtractor.main(SelfExtractor.java:398)

I am unable figure it out the cause of problem. Please help?

Your help is appreciated.

***Updated by moderator: Lochan to add Categories***

Low-Code App Development Installation and Deployment
Moderation Team has archived post
Share this page LinkedIn