Question

1
Replies
774
Views
premansus Member since 2016 1 post
Techmahindra
Posted: December 2, 2017
Last activity: May 26, 2018
Closed

installation issue.

Hi Team,
while installing my personal edition of (CSA _7.3.1). i am getting below error, could you please help resolving this.
BUILD FAILED
C:\Users\Prem \Documents\Downloads\115633_PE_7.3.1\pegaGuiInstallerTemp\build.xml:214: The following error occurred while executing this line:
C:\Users\Prem \Documents\Downloads\115633_PE_7.3.1\pegaGuiInstallerTemp\build.xml:82: exec returned: 1
Total time: 23 minutes 39 seconds
org.tp23.antinstaller.InstallException: Use logs to find the cause, then correct and run again
at org.tp23.antinstaller.runtime.exe.AntLauncherFilter.exec(AntLauncherFilter.java:90)
at org.tp23.antinstaller.runtime.ExecInstall.exec(ExecInstall.java:87)
at org.tp23.antinstaller.selfextract.SelfExtractor.main(SelfExtractor.java:398)
Caused by: org.tp23.antinstaller.InstallException: Use logs to find the cause, then correct and run again
at org.tp23.antinstaller.runtime.exe.AntLauncherFilter.exec(AntLauncherFilter.java:80)
... 2 more
--- Nested Exception ---
org.tp23.antinstaller.InstallException: Use logs to find the cause, then correct and run again
at org.tp23.antinstaller.runtime.exe.AntLauncherFilter.exec(AntLauncherFilter.java:80)
at org.tp23.antinstaller.runtime.ExecInstall.exec(ExecInstall.java:87)
at org.tp23.antinstaller.selfextract.SelfExtractor.main(SelfExtractor.java:398)
Regards,
Premansu
Low-Code App Development
Moderation Team has archived post
Share this page LinkedIn