Question

7
Replies
193
Views
AnkuK339 Member since 2016 2 posts
Capgemini
Posted: 4 years ago
Last activity: 4 years 7 months ago
Closed
Solved

Hi I am getting below error while Installing Pega7

BUILD FAILED

I:\Pega\PegaPearsonEdition_V7.1\114898_PE719\pegaGuiInstallerTemp6\build.xml:157: Unable to connect to database within 15 seconds.

Total time: 1 minute 23 seconds

org.tp23.antinstaller.InstallException: Use logs to find the cause, then correct and run again

  at org.tp23.antinstaller.runtime.exe.AntLauncherFilter.exec(AntLauncherFilter.java:89)

  at org.tp23.antinstaller.runtime.ExecInstall.exec(ExecInstall.java:87)

  at org.tp23.antinstaller.selfextract.SelfExtractor.main(SelfExtractor.java:398)

Caused by: org.tp23.antinstaller.InstallException: Use logs to find the cause, then correct and run again

  at org.tp23.antinstaller.runtime.exe.AntLauncherFilter.exec(AntLauncherFilter.java:79)

  ... 2 more

--- Nested Exception ---

org.tp23.antinstaller.InstallException: Use logs to find the cause, then correct and run again

  at org.tp23.antinstaller.runtime.exe.AntLauncherFilter.exec(AntLauncherFilter.java:79)

  at org.tp23.antinstaller.runtime.ExecInstall.exec(ExecInstall.java:87)

  at org.tp23.antinstaller.selfextract.SelfExtractor.main(SelfExtractor.java:398)

Message was edited by: Lochana to add Categories

Low-Code App Development Installation and Deployment Data Integration
Moderation Team has archived post
Share this page LinkedIn